[linux_var] errore compilazione

^(o,o)^ Turk2000 acnrvi a tin.it
Mar 13 Gen 2004 14:49:25 UTC


On Mon, 12 Jan 2004, elvismetal a libero.it wrote:

 #- elvism --# Date: Mon, 12 Jan 2004 23:41:32 +0100
 #- elvism --# From: "elvismetal a libero.it" <elvismetal a libero.it>
 #- elvism --# Reply-To: talking a ml.linuxvar.it
 #- elvism --# To: . . <talking a ml.linuxvar.it>
 #- elvism --# Subject: [linux_var] errore compilazione
 #- elvism --#
 #- elvism --# Nn ho scritto prima xk mi sembrava troppo..cmq ecco qui quello ke mi dice il make:
 #- elvism --#
 #- elvism --# make[1]: Entering directory `/home/HelLViS69/bin/aterm-0.4.2/src'
 #- elvism --# /bin/sed -n -f ./makeprotos-sed command.c > command.pro
 #- elvism --# /bin/sed -n -f ./makeprotos-sed graphics.c > graphics.pro
 #- elvism --# /bin/sed -n -f ./makeprotos-sed grkelot.c > grkelot.pro
 #- elvism --# /bin/sed -n -f ./makeprotos-sed main.c > main.pro
 #- elvism --# /bin/sed -n -f ./makeprotos-sed menubar.c > menubar.pro
 #- elvism --# /bin/sed -n -f ./makeprotos-sed misc.c > misc.pro
 #- elvism --# /bin/sed -n -f ./makeprotos-sed netdisp.c > netdisp.pro
 #- elvism --# /bin/sed -n -f ./makeprotos-sed rmemset.c > rmemset.pro
 #- elvism --# /bin/sed -n -f ./makeprotos-sed screen.c > screen.pro
 #- elvism --# /bin/sed -n -f ./makeprotos-sed scrollbar2.c > scrollbar2.pro
 #- elvism --# /bin/sed -n -f ./makeprotos-sed utmp.c > utmp.pro
 #- elvism --# /bin/sed -n -f ./makeprotos-sed xdefaults.c > xdefaults.pro
 #- elvism --# /bin/sed -n -f ./makeprotos-sed pixmap.c > pixmap.pro
 #- elvism --# /bin/sed -n -f ./makeprotos-sed ximage_utils.c > ximage_utils.pro
 #- elvism --# /bin/sed -n -f ./makeprotos-sed thai.c > thai.pro
 #- elvism --# gcc -DHAVE_CONFIG_H -DDEBUG_STRICT  -c    -I. -I.. -I.  -O command.c
 #- elvism --# In file included from command.c:49:
 #- elvism --# rxvt.h:140:73: X11/Intrinsic.h: No such file or directory
 #- elvism --# rxvt.h:141:28: X11/cursorfont.h: No such file or directory
 #- elvism --# rxvt.h:142:24: X11/keysym.h: No such file or directory
 #- elvism --# In file included from command.c:49:
 #- elvism --# rxvt.h:201: error: parse error before "XColor"
 #- elvism --# rxvt.h:201: warning: no semicolon at end of struct or union
 #- elvism --# rxvt.h:203: error: parse error before '}' token
 #- elvism --# rxvt.h:203: warning: data definition has no type or storage class
 #- elvism --# rxvt.h:210: error: parse error before "Pixmap"
 #- elvism --# rxvt.h:210: warning: no semicolon at end of struct or union
 #- elvism --# rxvt.h:245: error: parse error before "trgPixmap"
 #- elvism --# rxvt.h:245: warning: data definition has no type or storage class
 #- elvism --# rxvt.h:254: error: parse error before "Shading"
 #- elvism --# rxvt.h:254: warning: data definition has no type or storage class
 #- elvism --# rxvt.h:256: warning: data definition has no type or storage class
 #- elvism --# rxvt.h:274: error: parse error before "Window"
 #- elvism --# rxvt.h:274: warning: no semicolon at end of struct or union
 #- elvism --# rxvt.h:275: warning: data definition has no type or storage class
 #- elvism --# rxvt.h:276: error: parse error before '*' token
 #- elvism --# rxvt.h:276: warning: data definition has no type or storage class
 #- elvism --# rxvt.h:278: error: parse error before '*' token
 #- elvism --# rxvt.h:278: warning: data definition has no type or storage class
 #- elvism --# rxvt.h:284: error: parse error before "background"
 #- elvism --# rxvt.h:284: warning: data definition has no type or storage class
 #- elvism --# rxvt.h:304: error: parse error before "tintGC"
 #- elvism --# rxvt.h:304: warning: data definition has no type or storage class
 #- elvism --# rxvt.h:305: error: parse error before "LastPixmapUsed"
 #- elvism --# rxvt.h:305: warning: data definition has no type or storage class
 #- elvism --# rxvt.h:309: error: parse error before '}' token
 #- elvism --# rxvt.h:309: warning: data definition has no type or storage class
 #- elvism --# rxvt.h:315: error: parse error before "Window"
 #- elvism --# rxvt.h:315: warning: no semicolon at end of struct or union
 #- elvism --# rxvt.h:316: warning: data definition has no type or storage class
 #- elvism --# rxvt.h:320: error: parse error before "Window"
 #- elvism --# rxvt.h:320: warning: no semicolon at end of struct or union
 #- elvism --# rxvt.h:321: warning: data definition has no type or storage class
 #- elvism --# rxvt.h:365: error: parse error before "Window"
 #- elvism --# rxvt.h:365: warning: no semicolon at end of struct or union
 #- elvism --# rxvt.h:369: error: parse error before '}' token
 #- elvism --# rxvt.h:369: warning: data definition has no type or storage class
 #- elvism --# rxvt.h:372: error: parse error before "menu_t"
 #- elvism --# rxvt.h:372: warning: no semicolon at end of struct or union
 #- elvism --# rxvt.h:381: error: parse error before '}' token
 #- elvism --# rxvt.h:381: warning: data definition has no type or storage class
 #- elvism --# rxvt.h:393: error: parse error before "Window"
 #- elvism --# rxvt.h:393: warning: no semicolon at end of struct or union
 #- elvism --# rxvt.h:394: error: conflicting types for `x'
 #- elvism --# rxvt.h:366: error: previous declaration of `x'
 #- elvism --# rxvt.h:394: error: conflicting types for `y'
 #- elvism --# rxvt.h:367: error: previous declaration of `y'
 #- elvism --# rxvt.h:395: error: conflicting types for `w'
 #- elvism --# rxvt.h:368: error: previous declaration of `w'
 #- elvism --# rxvt.h:395: error: conflicting types for `h'
 #- elvism --# rxvt.h:368: error: previous declaration of `h'
 #- elvism --# rxvt.h:399: error: parse error before '}' token
 #- elvism --# rxvt.h:399: warning: data definition has no type or storage class
 #- elvism --# rxvt.h:889: error: parse error before "Xcmap"
 #- elvism --# rxvt.h:889: warning: data definition has no type or storage class
 #- elvism --# rxvt.h:891: error: parse error before '*' token
 #- elvism --# rxvt.h:891: warning: data definition has no type or storage class
 #- elvism --# rxvt.h:902: error: parse error before "TermWin"
 #- elvism --# rxvt.h:902: warning: data definition has no type or storage class
 #- elvism --# rxvt.h:905: error: parse error before "ParentWin"
 #- elvism --# rxvt.h:905: warning: data definition has no type or storage class
 #- elvism --# rxvt.h:908: error: parse error before "scrollBar"
 #- elvism --# rxvt.h:908: warning: data definition has no type or storage class
 #- elvism --# rxvt.h:909: error: parse error before "menuBar"
 #- elvism --# rxvt.h:909: warning: data definition has no type or storage class
 #- elvism --# rxvt.h:910: error: parse error before '*' token
 #- elvism --# rxvt.h:910: warning: data definition has no type or storage class
 #- elvism --# rxvt.h:918: error: parse error before "PixColorsFocused"
 #- elvism --# rxvt.h:918: warning: data definition has no type or storage class
 #- elvism --# rxvt.h:920: error: parse error before "PixColorsUnFocused"
 #- elvism --# rxvt.h:920: warning: data definition has no type or storage class
 #- elvism --# rxvt.h:925: error: parse error before '*' token
 #- elvism --# rxvt.h:925: warning: data definition has no type or storage class
 #- elvism --# In file included from protos.h:5,
 #- elvism --#                  from rxvt.h:992,
 #- elvism --#                  from command.c:49:
 #- elvism --# command.pro:15: error: parse error before '*' token
 #- elvism --# command.pro:18: error: parse error before '*' token
 #- elvism --# command.pro:19: error: parse error before '*' token
 #- elvism --# In file included from protos.h:6,
 #- elvism --#                  from rxvt.h:992,
 #- elvism --#                  from command.c:49:
 #- elvism --# graphics.pro:2: error: parse error before '*' token
 #- elvism --# graphics.pro:3: error: parse error before '*' token
 #- elvism --# graphics.pro:4: error: parse error before '*' token
 #- elvism --# graphics.pro:5: error: parse error before '*' token
 #- elvism --# graphics.pro:6: error: parse error before '*' token
 #- elvism --# graphics.pro:7: error: parse error before '*' token
 #- elvism --# graphics.pro:13: error: parse error before "win"
 #- elvism --# In file included from protos.h:8,
 #- elvism --#                  from rxvt.h:992,
 #- elvism --#                  from command.c:49:
 #- elvism --# main.pro:1: error: parse error before "xerror_handler"
 #- elvism --# main.pro:1: error: parse error before '*' token
 #- elvism --# main.pro:1: warning: data definition has no type or storage class
 #- elvism --# main.pro:11: error: parse error before '*' token
 #- elvism --# In file included from protos.h:9,
 #- elvism --#                  from rxvt.h:992,
 #- elvism --#                  from command.c:49:
 #- elvism --# menubar.pro:1: error: parse error before '*' token
 #- elvism --# menubar.pro:2: error: parse error before '*' token
 #- elvism --# menubar.pro:8: error: parse error before '*' token
 #- elvism --# menubar.pro:9: error: parse error before '*' token
 #- elvism --# menubar.pro:10: error: parse error before '*' token
 #- elvism --# menubar.pro:10: error: parse error before '*' token
 #- elvism --# menubar.pro:10: warning: data definition has no type or storage class
 #- elvism --# menubar.pro:11: error: parse error before '*' token
 #- elvism --# menubar.pro:11: error: parse error before '*' token
 #- elvism --# menubar.pro:11: warning: data definition has no type or storage class
 #- elvism --# menubar.pro:15: error: parse error before '*' token
 #- elvism --# menubar.pro:16: error: parse error before '*' token
 #- elvism --# menubar.pro:21: error: parse error before '*' token
 #- elvism --# menubar.pro:23: error: parse error before '*' token
 #- elvism --# menubar.pro:23: warning: data definition has no type or storage class
 #- elvism --# menubar.pro:27: error: parse error before "menu_t"
 #- elvism --# menubar.pro:34: error: parse error before '*' token
 #- elvism --# menubar.pro:35: error: parse error before '*' token
 #- elvism --# menubar.pro:36: error: parse error before '*' token
 #- elvism --# menubar.pro:38: error: parse error before "cursor"
 #- elvism --# In file included from protos.h:10,
 #- elvism --#                  from rxvt.h:992,
 #- elvism --#                  from command.c:49:
 #- elvism --# misc.pro:9: error: parse error before "win"
 #- elvism --# misc.pro:10: error: parse error before "win"
 #- elvism --# misc.pro:11: error: parse error before "win"
 #- elvism --# misc.pro:12: error: parse error before "win"
 #- elvism --# In file included from protos.h:13,
 #- elvism --#                  from rxvt.h:992,
 #- elvism --#                  from command.c:49:
 #- elvism --# screen.pro:50: error: parse error before "win"
 #- elvism --# screen.pro:51: error: parse error before "tm"
 #- elvism --# screen.pro:53: error: parse error before "tm"
 #- elvism --# screen.pro:60: error: parse error before '*' token
 #- elvism --# In file included from protos.h:23,
 #- elvism --#                  from rxvt.h:992,
 #- elvism --#                  from command.c:49:
 #- elvism --# xdefaults.pro:6: error: parse error before "define_key"
 #- elvism --# xdefaults.pro:6: error: parse error before '*' token
 #- elvism --# xdefaults.pro:6: warning: data definition has no type or storage class
 #- elvism --# xdefaults.pro:9: error: parse error before '*' token
 #- elvism --# In file included from protos.h:24,
 #- elvism --#                  from rxvt.h:992,
 #- elvism --#                  from command.c:49:
 #- elvism --# pixmap.pro:2: error: parse error before "GetRootPixmap"
 #- elvism --# pixmap.pro:2: error: parse error before "id"
 #- elvism --# pixmap.pro:2: warning: data definition has no type or storage class
 #- elvism --# pixmap.pro:4: error: parse error before "SetSrcPixmap"
 #- elvism --# pixmap.pro:4: error: parse error before "p"
 #- elvism --# pixmap.pro:4: warning: data definition has no type or storage class
 #- elvism --# command.c:54:24: X11/Xatom.h: No such file or directory
 #- elvism --# command.c:68:24: X11/keysym.h: No such file or directory
 #- elvism --# command.c:99: error: parse error before '*' token
 #- elvism --# command.c:265: error: `Mod1Mask' undeclared here (not in a function)
 #- elvism --# command.c:304: error: parse error before "wmDeleteWindow"
 #- elvism --# command.c:304: warning: data definition has no type or storage class
 #- elvism --# command.c: In function `run_command':
 #- elvism --# command.c:957: error: request for member `state' in something not a structure or
 #- elvism --# union
 #- elvism --# command.c: In function `get_ourmods':
 #- elvism --# command.c:1082: error: `XModifierKeymap' undeclared (first use in this function)
 #- elvism --# command.c:1082: error: (Each undeclared identifier is reported only once
 #- elvism --# command.c:1082: error: for each function it appears in.)
 #- elvism --# command.c:1082: error: `map' undeclared (first use in this function)
 #- elvism --# command.c:1083: error: `KeyCode' undeclared (first use in this function)
 #- elvism --# command.c:1083: error: `kc' undeclared (first use in this function)
 #- elvism --# command.c:1085: error: `Mod1Mask' undeclared (first use in this function)
 #- elvism --# command.c:1085: error: `Mod2Mask' undeclared (first use in this function)
 #- elvism --# command.c:1085: error: `Mod3Mask' undeclared (first use in this function)
 #- elvism --# command.c:1085: error: `Mod4Mask' undeclared (first use in this function)
 #- elvism --# command.c:1085: error: `Mod5Mask' undeclared (first use in this function)
 #- elvism --# command.c:1096: error: `XK_Num_Lock' undeclared (first use in this function)
 #- elvism --# command.c:1102: error: `XK_Meta_L' undeclared (first use in this function)
 #- elvism --# command.c:1103: error: `XK_Meta_R' undeclared (first use in this function)
 #- elvism --# command.c:1104: error: `XK_Alt_L' undeclared (first use in this function)
 #- elvism --# command.c:1105: error: `XK_Alt_R' undeclared (first use in this function)
 #- elvism --# command.c: In function `init_command':
 #- elvism --# command.c:1131: error: `False' undeclared (first use in this function)
 #- elvism --# command.c:1132: error: request for member `parent' in something not a structure
 #- elvism --# or union
 #- elvism --# command.c:1158: error: `Mod2Mask' undeclared (first use in this function)
 #- elvism --# command.c:1161: error: `Mod3Mask' undeclared (first use in this function)
 #- elvism --# command.c:1164: error: `Mod4Mask' undeclared (first use in this function)
 #- elvism --# command.c:1167: error: `Mod5Mask' undeclared (first use in this function)
 #- elvism --# command.c:1170: error: `Mod1Mask' undeclared (first use in this function)
 #- elvism --# command.c: In function `tt_winsize':
 #- elvism --# command.c:1332: error: request for member `ncol' in something not a structure or
 #- elvism --# union
 #- elvism --# command.c:1333: error: request for member `nrow' in something not a structure or
 #- elvism --# union
 #- elvism --# command.c: At top level:
 #- elvism --# command.c:1352: error: parse error before '*' token
 #- elvism --# command.c: In function `lookup_key':
 #- elvism --# command.c:1362: error: syntax error before "compose"
 #- elvism --# command.c:1366: error: `KeySym' undeclared (first use in this function)
 #- elvism --# command.c:1366: error: parse error before "keysym"
 #- elvism --# command.c:1374: error: `ev' undeclared (first use in this function)
 #- elvism --# command.c:1374: error: `ShiftMask' undeclared (first use in this function)
 #- elvism --# command.c:1375: error: `ControlMask' undeclared (first use in this function)
 #- elvism --# command.c:1398: error: `keysym' undeclared (first use in this function)
 #- elvism --# command.c:1398: error: `compose' undeclared (first use in this function)
 #- elvism --# command.c:1410: error: request for member `view_start' in something not a
 #- elvism --# structure or union
 #- elvism --# command.c:1435: error: `XK_F1' undeclared (first use in this function)
 #- elvism --# command.c:1435: error: `XK_F10' undeclared (first use in this function)
 #- elvism --# command.c:1436: error: `XK_F11' undeclared (first use in this function)
 #- elvism --# command.c:1439: error: request for member `nrow' in something not a structure or
 #- elvism --# union
 #- elvism --# command.c:1442: error: request for member `nrow' in something not a structure or
 #- elvism --# union
 #- elvism --# command.c:1447: error: `XK_Prior' undeclared (first use in this function)
 #- elvism --# command.c:1448: error: request for member `saveLines' in something not a
 #- elvism --# structure or union
 #- elvism --# command.c:1454: error: `XK_Up' undeclared (first use in this function)
 #- elvism --# command.c:1455: error: request for member `saveLines' in something not a
 #- elvism --# structure or union
 #- elvism --# command.c:1461: error: `XK_Down' undeclared (first use in this function)
 #- elvism --# command.c:1462: error: request for member `saveLines' in something not a
 #- elvism --# structure or union
 #- elvism --# command.c:1468: error: `XK_Next' undeclared (first use in this function)
 #- elvism --# command.c:1469: error: request for member `saveLines' in something not a
 #- elvism --# structure or union
 #- elvism --# command.c:1475: error: `XK_Insert' undeclared (first use in this function)
 #- elvism --# command.c:1481: error: `XK_KP_Add' undeclared (first use in this function)
 #- elvism --# command.c:1486: error: `XK_KP_Subtract' undeclared (first use in this function)
 #- elvism --# command.c:1514: error: `XK_Print' undeclared (first use in this function)
 #- elvism --# command.c:1521: error: `XK_Mode_switch' undeclared (first use in this function)
 #- elvism --# command.c:1560: error: `XK_BackSpace' undeclared (first use in this function)
 #- elvism --# command.c:1570: error: `XK_Delete' undeclared (first use in this function)
 #- elvism --# command.c:1574: error: `XK_Tab' undeclared (first use in this function)
 #- elvism --# command.c:1591: error: `XK_Home' undeclared (first use in this function)
 #- elvism --# command.c:1611: error: `XK_Left' undeclared (first use in this function)
 #- elvism --# command.c:1613: error: `XK_Right' undeclared (first use in this function)
 #- elvism --# command.c:1669: error: `XK_End' undeclared (first use in this function)
 #- elvism --# command.c:1673: error: `XK_Select' undeclared (first use in this function)
 #- elvism --# command.c:1680: error: `XK_Execute' undeclared (first use in this function)
 #- elvism --# command.c:1689: error: `XK_Menu' undeclared (first use in this function)
 #- elvism --# command.c:1693: error: `XK_Find' undeclared (first use in this function)
 #- elvism --# command.c:1697: error: `XK_Help' undeclared (first use in this function)
 #- elvism --# command.c:1702: error: `XK_KP_Enter' undeclared (first use in this function)
 #- elvism --# command.c:1730: error: `XK_KP_F1' undeclared (first use in this function)
 #- elvism --# command.c:1731: error: `XK_KP_F2' undeclared (first use in this function)
 #- elvism --# command.c:1732: error: `XK_KP_F3' undeclared (first use in this function)
 #- elvism --# command.c:1733: error: `XK_KP_F4' undeclared (first use in this function)
 #- elvism --# command.c:1739: error: `XK_KP_Multiply' undeclared (first use in this function)
 #- elvism --# command.c:1741: error: `XK_KP_Separator' undeclared (first use in this function)
 #- elvism --# command.c:1743: error: `XK_KP_Decimal' undeclared (first use in this function)
 #- elvism --# command.c:1744: error: `XK_KP_Divide' undeclared (first use in this function)
 #- elvism --# command.c:1745: error: `XK_KP_0' undeclared (first use in this function)
 #- elvism --# command.c:1746: error: `XK_KP_1' undeclared (first use in this function)
 #- elvism --# command.c:1747: error: `XK_KP_2' undeclared (first use in this function)
 #- elvism --# command.c:1748: error: `XK_KP_3' undeclared (first use in this function)
 #- elvism --# command.c:1749: error: `XK_KP_4' undeclared (first use in this function)
 #- elvism --# command.c:1750: error: `XK_KP_5' undeclared (first use in this function)
 #- elvism --# command.c:1751: error: `XK_KP_6' undeclared (first use in this function)
 #- elvism --# command.c:1752: error: `XK_KP_7' undeclared (first use in this function)
 #- elvism --# command.c:1753: error: `XK_KP_8' undeclared (first use in this function)
 #- elvism --# command.c:1754: error: `XK_KP_9' undeclared (first use in this function)
 #- elvism --# command.c:1771: error: `XK_F2' undeclared (first use in this function)
 #- elvism --# command.c:1772: error: `XK_F3' undeclared (first use in this function)
 #- elvism --# command.c:1773: error: `XK_F4' undeclared (first use in this function)
 #- elvism --# command.c:1774: error: `XK_F5' undeclared (first use in this function)
 #- elvism --# command.c:1778: error: `XK_F6' undeclared (first use in this function)
 #- elvism --# command.c:1779: error: `XK_F7' undeclared (first use in this function)
 #- elvism --# command.c:1780: error: `XK_F8' undeclared (first use in this function)
 #- elvism --# command.c:1781: error: `XK_F9' undeclared (first use in this function)
 #- elvism --# command.c:1787: error: `XK_F12' undeclared (first use in this function)
 #- elvism --# command.c:1788: error: `XK_F13' undeclared (first use in this function)
 #- elvism --# command.c:1789: error: `XK_F14' undeclared (first use in this function)
 #- elvism --# command.c:1793: error: `XK_F15' undeclared (first use in this function)
 #- elvism --# command.c:1794: error: `XK_F16' undeclared (first use in this function)
 #- elvism --# command.c:1798: error: `XK_F17' undeclared (first use in this function)
 #- elvism --# command.c:1799: error: `XK_F18' undeclared (first use in this function)
 #- elvism --# command.c:1800: error: `XK_F19' undeclared (first use in this function)
 #- elvism --# command.c:1801: error: `XK_F20' undeclared (first use in this function)
 #- elvism --# command.c:1802: error: `XK_F21' undeclared (first use in this function)
 #- elvism --# command.c:1803: error: `XK_F22' undeclared (first use in this function)
 #- elvism --# command.c:1804: error: `XK_F23' undeclared (first use in this function)
 #- elvism --# command.c:1805: error: `XK_F24' undeclared (first use in this function)
 #- elvism --# command.c:1806: error: `XK_F25' undeclared (first use in this function)
 #- elvism --# command.c:1807: error: `XK_F26' undeclared (first use in this function)
 #- elvism --# command.c:1808: error: `XK_F27' undeclared (first use in this function)
 #- elvism --# command.c:1809: error: `XK_F28' undeclared (first use in this function)
 #- elvism --# command.c:1810: error: `XK_F29' undeclared (first use in this function)
 #- elvism --# command.c:1811: error: `XK_F30' undeclared (first use in this function)
 #- elvism --# command.c:1812: error: `XK_F31' undeclared (first use in this function)
 #- elvism --# command.c:1813: error: `XK_F32' undeclared (first use in this function)
 #- elvism --# command.c:1814: error: `XK_F33' undeclared (first use in this function)
 #- elvism --# command.c:1815: error: `XK_F34' undeclared (first use in this function)
 #- elvism --# command.c:1816: error: `XK_F35' undeclared (first use in this function)
 #- elvism --# command.c:1829: error: `XK_minus' undeclared (first use in this function)
 #- elvism --# command.c: In function `cmd_getc':
 #- elvism --# command.c:1962: error: request for member `nrow' in something not a structure or
 #- elvism --# union
 #- elvism --# command.c:1977: error: `XEvent' undeclared (first use in this function)
 #- elvism --# command.c:1977: error: parse error before "ev"
 #- elvism --# command.c:1980: error: `ev' undeclared (first use in this function)
 #- elvism --# command.c:1988: error: request for member `state' in something not a structure
 #- elvism --# or union
 #- elvism --# command.c:1994: error: request for member `state' in something not a structure
 #- elvism --# or union
 #- elvism --# command.c:2018: error: request for member `state' in something not a structure
 #- elvism --# or union
 #- elvism --# command.c: At top level:
 #- elvism --# command.c:2071: error: parse error before "Time"
 #- elvism --# command.c:2071: warning: no semicolon at end of struct or union
 #- elvism --# command.c:2074: error: parse error before '}' token
 #- elvism --# command.c:2075: error: `CurrentTime' undeclared here (not in a function)
 #- elvism --# command.c:2075: warning: excess elements in scalar initializer
 #- elvism --# command.c:2075: warning: (near initialization for `MEvent')
 #- elvism --# command.c:2075: warning: excess elements in scalar initializer
 #- elvism --# command.c:2075: warning: (near initialization for `MEvent')
 #- elvism --# command.c:2076: error: `AnyButton' undeclared here (not in a function)
 #- elvism --# command.c:2076: warning: excess elements in scalar initializer
 #- elvism --# command.c:2076: warning: (near initialization for `MEvent')
 #- elvism --# command.c:2076: warning: data definition has no type or storage class
 #- elvism --# command.c:2080: error: parse error before '*' token
 #- elvism --# command.c: In function `mouse_report':
 #- elvism --# command.c:2085: error: `ev' undeclared (first use in this function)
 #- elvism --# command.c:2089: error: request for member `button' in something not a structure
 #- elvism --# or union
 #- elvism --# command.c:2089: error: `AnyButton' undeclared (first use in this function)
 #- elvism --# command.c:2090: error: request for member `button' in something not a structure
 #- elvism --# or union
 #- elvism --# command.c:2090: error: `Button1' undeclared (first use in this function)
 #- elvism --# command.c:2113: error: request for member `state' in something not a structure
 #- elvism --# or union
 #- elvism --# command.c:2113: error: `ShiftMask' undeclared (first use in this function)
 #- elvism --# command.c:2113: error: `ControlMask' undeclared (first use in this function)
 #- elvism --# command.c:2114: error: request for member `state' in something not a structure
 #- elvism --# or union
 #- elvism --# command.c:2114: error: `Mod1Mask' undeclared (first use in this function)
 #- elvism --# command.c: At top level:
 #- elvism --# command.c:2146: error: parse error before '*' token
 #- elvism --# command.c: In function `process_x_event':
 #- elvism --# command.c:2153: error: `ev' undeclared (first use in this function)
 #- elvism --# command.c:2154: error: `KeyPress' undeclared (first use in this function)
 #- elvism --# command.c:2158: error: `ClientMessage' undeclared (first use in this function)
 #- elvism --# command.c:2190: error: `MappingNotify' undeclared (first use in this function)
 #- elvism --# command.c:2202: error: `VisibilityNotify' undeclared (first use in this function)
 #- elvism --# command.c:2204: error: `VisibilityUnobscured' undeclared (first use in this
 #- elvism --# function)
 #- elvism --# command.c:2208: error: `VisibilityPartiallyObscured' undeclared (first use in
 #- elvism --# this function)
 #- elvism --# command.c:2218: error: `FocusIn' undeclared (first use in this function)
 #- elvism --# command.c:2219: error: request for member `focus' in something not a structure
 #- elvism --# or union
 #- elvism --# command.c:2220: error: request for member `focus' in something not a structure
 #- elvism --# or union
 #- elvism --# command.c:2235: error: `FocusOut' undeclared (first use in this function)
 #- elvism --# command.c:2236: error: request for member `focus' in something not a structure
 #- elvism --# or union
 #- elvism --# command.c:2237: error: request for member `focus' in something not a structure
 #- elvism --# or union
 #- elvism --# command.c:2252: error: `ConfigureNotify' undeclared (first use in this function)
 #- elvism --# command.c:2257: error: `SelectionClear' undeclared (first use in this function)
 #- elvism --# command.c:2261: error: `SelectionNotify' undeclared (first use in this function)
 #- elvism --# command.c:2262: error: `True' undeclared (first use in this function)
 #- elvism --# command.c:2265: error: `SelectionRequest' undeclared (first use in this function)
 #- elvism --# command.c:2269: error: `PropertyNotify' undeclared (first use in this function)
 #- elvism --# command.c:2298: error: syntax error before "atom"
 #- elvism --# command.c:2299: error: `atom' undeclared (first use in this function)
 #- elvism --# command.c:2299: error: `None' undeclared (first use in this function)
 #- elvism --# command.c:2307: error: syntax error before "LastRPixmap"
 #- elvism --# command.c:2308: error: `Pixmap' undeclared (first use in this function)
 #- elvism --# command.c:2310: error: `currentRPixmap' undeclared (first use in this function)
 #- elvism --# command.c:2312: error: `LastRPixmap' undeclared (first use in this function)
 #- elvism --# command.c:2312: error: request for member `bMapped' in something not a structure
 #- elvism --# or union
 #- elvism --# command.c:2315: error: request for member `background' in something not a
 #- elvism --# structure or union
 #- elvism --# command.c:2334: error: request for member `bMapped' in something not a structure
 #- elvism --# or union
 #- elvism --# command.c:2339: error: `UnmapNotify' undeclared (first use in this function)
 #- elvism --# command.c:2340: error: request for member `bMapped' in something not a structure
 #- elvism --# or union
 #- elvism --# command.c:2344: error: `MapNotify' undeclared (first use in this function)
 #- elvism --# command.c:2354: error: request for member `bMapped' in something not a structure
 #- elvism --# or union
 #- elvism --# command.c:2359: error: parse error before "tmp"
 #- elvism --# command.c:2360: error: `tmp' undeclared (first use in this function)
 #- elvism --# command.c:2360: error: request for member `background' in something not a
 #- elvism --# structure or union
 #- elvism --# command.c:2360: error: request for member `background' in something not a
 #- elvism --# structure or union
 #- elvism --# command.c:2362: error: request for member `background' in something not a
 #- elvism --# structure or union
 #- elvism --# command.c:2373: error: `ReparentNotify' undeclared (first use in this function)
 #- elvism --# command.c:2377: error: `XWindowAttributes' undeclared (first use in this function)
 #- elvism --# command.c:2377: error: parse error before "attr"
 #- elvism --# command.c:2378: error: parse error before '*' token
 #- elvism --# command.c:2379: warning: initialization makes pointer from integer without a cast
 #- elvism --# command.c:2389: error: `Window' undeclared (first use in this function)
 #- elvism --# command.c:2389: error: parse error before "root"
 #- elvism --# command.c:2391: error: `list' undeclared (first use in this function)
 #- elvism --# command.c:2393: error: `root' undeclared (first use in this function)
 #- elvism --# command.c:2393: error: `parent' undeclared (first use in this function)
 #- elvism --# command.c:2401: error: `ParentRelative' undeclared (first use in this function)
 #- elvism --# command.c:2403: error: `attr' undeclared (first use in this function)
 #- elvism --# command.c:2404: error: request for member `bMapped' in something not a structure
 #- elvism --# or union
 #- elvism --# command.c:2404: error: `IsViewable' undeclared (first use in this function)
 #- elvism --# command.c:2411: error: `GraphicsExpose' undeclared (first use in this function)
 #- elvism --# command.c:2412: error: `Expose' undeclared (first use in this function)
 #- elvism --# command.c:2413: error: request for member `vt' in something not a structure or union
 #- elvism --# command.c:2417: error: `XEvent' undeclared (first use in this function)
 #- elvism --# command.c:2417: error: parse error before "unused_xevent"
 #- elvism --# command.c:2421: error: `unused_xevent' undeclared (first use in this function)
 #- elvism --# command.c:2425: error: request for member `state' in something not a structure
 #- elvism --# or union
 #- elvism --# command.c:2425: error: request for member `win' in something not a structure or
 #- elvism --# union
 #- elvism --# command.c:2426: error: request for member `state' in something not a structure
 #- elvism --# or union
 #- elvism --# command.c:2435: error: `ButtonPress' undeclared (first use in this function)
 #- elvism --# command.c:2436: error: `Mod1Mask' undeclared (first use in this function)
 #- elvism --# command.c:2436: error: `ShiftMask' undeclared (first use in this function)
 #- elvism --# command.c:2440: error: request for member `vt' in something not a structure or union
 #- elvism --# command.c:2447: error: request for member `state' in something not a structure
 #- elvism --# or union
 #- elvism --# command.c:2469: error: request for member `button' in something not a structure
 #- elvism --# or union
 #- elvism --# command.c:2473: error: request for member `button' in something not a structure
 #- elvism --# or union
 #- elvism --# command.c:2474: error: request for member `clicks' in something not a structure
 #- elvism --# or union
 #- elvism --# command.c:2476: error: `Button1' undeclared (first use in this function)
 #- elvism --# command.c:2477: error: request for member `button' in something not a structure
 #- elvism --# or union
 #- elvism --# command.c:2478: error: request for member `time' in something not a structure or
 #- elvism --# union
 #- elvism --# command.c:2479: error: request for member `clicks' in something not a structure
 #- elvism --# or union
 #- elvism --# command.c:2481: error: request for member `clicks' in something not a structure
 #- elvism --# or union
 #- elvism --# command.c:2482: error: request for member `clicks' in something not a structure
 #- elvism --# or union
 #- elvism --# command.c:2484: error: request for member `button' in something not a structure
 #- elvism --# or union
 #- elvism --# command.c:2487: error: `Button3' undeclared (first use in this function)
 #- elvism --# command.c:2488: error: request for member `button' in something not a structure
 #- elvism --# or union
 #- elvism --# command.c:2489: error: request for member `time' in something not a structure or
 #- elvism --# union
 #- elvism --# command.c:2493: error: request for member `button' in something not a structure
 #- elvism --# or union
 #- elvism --# command.c:2497: error: request for member `time' in something not a structure or
 #- elvism --# union
 #- elvism --# command.c:2501: error: request for member `state' in something not a structure
 #- elvism --# or union
 #- elvism --# command.c:2501: error: request for member `win' in something not a structure or
 #- elvism --# union
 #- elvism --# command.c:2502: error: request for member `state' in something not a structure
 #- elvism --# or union
 #- elvism --# command.c:2520: error: request for member `end' in something not a structure or
 #- elvism --# union
 #- elvism --# command.c:2520: error: request for member `end' in something not a structure or
 #- elvism --# union
 #- elvism --# command.c:2522: error: request for member `end' in something not a structure or
 #- elvism --# union
 #- elvism --# command.c:2526: error: `Button2' undeclared (first use in this function)
 #- elvism --# command.c:2539: error: request for member `end' in something not a structure or
 #- elvism --# union
 #- elvism --# command.c:2539: error: request for member `end' in something not a structure or
 #- elvism --# union
 #- elvism --# command.c:2544: error: request for member `state' in something not a structure
 #- elvism --# or union
 #- elvism --# command.c:2545: error: request for member `end' in something not a structure or
 #- elvism --# union
 #- elvism --# command.c:2550: error: request for member `state' in something not a structure
 #- elvism --# or union
 #- elvism --# command.c:2555: error: request for member `bot' in something not a structure or
 #- elvism --# union
 #- elvism --# command.c:2555: error: request for member `top' in something not a structure or
 #- elvism --# union
 #- elvism --# command.c:2563: error: request for member `beg' in something not a structure or
 #- elvism --# union
 #- elvism --# command.c:2564: error: request for member `end' in something not a structure or
 #- elvism --# union
 #- elvism --# command.c:2564: error: request for member `beg' in something not a structure or
 #- elvism --# union
 #- elvism --# command.c:2565: error: request for member `state' in something not a structure
 #- elvism --# or union
 #- elvism --# command.c:2570: error: request for member `top' in something not a structure or
 #- elvism --# union
 #- elvism --# command.c:2577: error: request for member `top' in something not a structure or
 #- elvism --# union
 #- elvism --# command.c:2579: error: request for member `nrow' in something not a structure or
 #- elvism --# union
 #- elvism --# command.c:2583: error: request for member `bot' in something not a structure or
 #- elvism --# union
 #- elvism --# command.c:2585: error: request for member `nrow' in something not a structure or
 #- elvism --# union
 #- elvism --# command.c:2590: error: request for member `state' in something not a structure
 #- elvism --# or union
 #- elvism --# command.c:2609: error: `ButtonRelease' undeclared (first use in this function)
 #- elvism --# command.c:2614: error: request for member `state' in something not a structure
 #- elvism --# or union
 #- elvism --# command.c:2615: error: request for member `state' in something not a structure
 #- elvism --# or union
 #- elvism --# command.c:2621: error: request for member `vt' in something not a structure or union
 #- elvism --# command.c:2638: error: request for member `button' in something not a structure
 #- elvism --# or union
 #- elvism --# command.c:2638: error: `AnyButton' undeclared (first use in this function)
 #- elvism --# command.c:2650: error: request for member `clicks' in something not a structure
 #- elvism --# or union
 #- elvism --# command.c:2664: error: `Button4' undeclared (first use in this function)
 #- elvism --# command.c:2667: error: `Button5' undeclared (first use in this function)
 #- elvism --# command.c:2678: error: `MotionNotify' undeclared (first use in this function)
 #- elvism --# command.c:2686: error: request for member `vt' in something not a structure or union
 #- elvism --# command.c:2687: error: `Button1Mask' undeclared (first use in this function)
 #- elvism --# command.c:2687: error: `Button3Mask' undeclared (first use in this function)
 #- elvism --# command.c:2688: error: parse error before "unused_root"
 #- elvism --# command.c:2692: error: request for member `vt' in something not a structure or union
 #- elvism --# command.c:2694: error: request for member `vt' in something not a structure or union
 #- elvism --# command.c:2695: error: `unused_root' undeclared (first use in this function)
 #- elvism --# command.c:2695: error: `unused_child' undeclared (first use in this function)
 #- elvism --# command.c:2701: error: request for member `time' in something not a structure or
 #- elvism --# union
 #- elvism --# command.c:2706: error: request for member `win' in something not a structure or
 #- elvism --# union
 #- elvism --# command.c:2706: error: request for member `state' in something not a structure
 #- elvism --# or union
 #- elvism --# command.c:2707: error: parse error before "unused_root"
 #- elvism --# command.c:2711: error: request for member `win' in something not a structure or
 #- elvism --# union
 #- elvism --# command.c:2713: error: request for member `win' in something not a structure or
 #- elvism --# union
 #- elvism --# command.c:2718: error: request for member `beg' in something not a structure or
 #- elvism --# union
 #- elvism --# command.c:2719: error: request for member `end' in something not a structure or
 #- elvism --# union
 #- elvism --# command.c:2719: error: request for member `beg' in something not a structure or
 #- elvism --# union
 #- elvism --# command.c: In function `main_loop':
 #- elvism --# command.c:3476: error: request for member `nrow' in something not a structure or
 #- elvism --# union
 #- elvism --# make[1]: *** [command.o] Error 1
 #- elvism --#
 #- elvism --# A me sembrano errori di codice, voi ke dite?
 #- elvism --#
 #- elvism --#
 #- elvism --#   (--- * * * * * * * * * * * * * * * * * * * * * * ---)
 #- elvism --# Per cancellare l'iscrizione: <talking-unsubscribe at ml.linuxvar.it>
 #- elvism --# Interfaccia web di configurazione: http://ml.linuxvar.it/ml/
 #- elvism --#

per i primi tre include di X11 non trovati forse ti manca un link da
/usr/X11R6/include/X11 -> /usr/include/X11 a volte per evitare questo tipo
di errore si puo' passare a configure --with-x=<path> dove path potrebbe
essere /usr/X11R6, pero' non so.

Turk



More information about the Talking mailing list